{"text_format":"1","workbook":"xlsx","n_sheets":6,"sheets":["Maestra","Round Robin ","Round Robin (2)","Eliminación Sencilla","Eliminación Sencilla B","Hoja1"],"not_rendered":{"charts":0,"images":6,"macros":1,"external_links":0,"defined_names":14,"comments":2,"pivot_tables":0},"unopened":[],"bounds":{"document_bytes":16777216,"sheet_cells":100000,"rows_first":2000,"rows_last":500,"rows_between":2000,"halvings":0,"cell_chars":16384,"cell_head_chars":4096},"cells_cut":0,"cells_raw":0,"read":"whole","date_system":"1900"}

{"sheet":"Maestra","index":0,"n_rows":18,"n_cols":8,"rows_kept":18,"cut":false,"hidden":false,"merged":[]}
[null,null,"HOJA MAESTRA"]
[]
["ESTA HOJA LLENA EL ENCABEZAMIENTO DE TODAS LAS OTRAS, NO LA BORRE NI LA ELIMINE"]
["EN TODO ESTE ARCHIVO, ESCRIBA SOLO EN LAS AREAS GRISES"]
["CUANDO LLENE LAS AREAS GRISES DE ESTA HOJA, GUARDE COMO (Nombre que quiera darle) "]
["Y CONTINUE CON SU TRABAJO EN LAS OTRAS HOJAS. RECUERDE, EN TODAS LAS HOJAS, SÓLO PODRA"]
["ESCRIBIR EN LAS AREAS GRISES."]
["TORNEO",null,null,null,"CLASE",null,null,"CATEGORIA"]
[]
["4TA PARADA DEPARTAMENTAL INFANTIL 2019",null,null,null,"SENCILLOS ",null,null,"HASTA 10 AÑOS"]
[]
["SEDE",null,null,null,"CIUDAD",null,null,"FECHA"]
[]
["LIGA SANTANDEREANA DE TENIS",null,null,null,"BUCARAMANGA",null,null,"2019-10-26"]
[null,null,null,null,null,null,null,"D/M/A"]
["COORDINADORA",null,null,null,"SUPERFICIE"]
[]
["PAOLA A CHINCHILLA ",null,null,null,"POLVO DE LADRILLO "]

{"sheet":"Round Robin ","index":1,"n_rows":34,"n_cols":33,"rows_kept":34,"cut":false,"hidden":false,"merged":[[6,7,6,16]]}
[null,null,null,null,"SENCILLOS CUADRO DE ROUND ROBIN"]
["Torneo",null,null,null,{"$f":"Maestra!A10","v":"4TA PARADA DEPARTAMENTAL INFANTIL 2019"}]
["Sede",null,null,null,{"$f":"Maestra!A14","v":"LIGA SANTANDEREANA DE TENIS"}]
["Clase",null,null,null,{"$f":"Maestra!E10","v":"SENCILLOS "}]
["Ciudad",null,null,null,{"$f":"Maestra!E14","v":"BUCARAMANGA"}]
["Categoría",null,null,null,{"$f":"Maestra!H10","v":"HASTA 10 AÑOS"}]
["Fecha",null,{"$f":"Maestra!H14","v":"2019-10-26"},null,null,null,null,"COORDINADORA",null,null,null,null,null,null,null,null,null,null,null,null,null,null,null,null,null,null,null,null,null,{"$f":"Maestra!A18","v":"PAOLA A CHINCHILLA "}]
[null,null,"CUADRO NO. 1"]
["N°","Rank","NOMBRE",null,"Liga",null,null,null,1,null,null,null,null,null,2,null,null,null,null,null,3,null,null,null,null,null,4,null,null,"PUNTOS","% SETS","% GAMES","PUESTO"]
[1,null,"EMANUEL JOSEPH CARRILLO V.",null,"LT",null,null,null,null,null,null,4,2,4,0,null,null,4,1,4,0,null,null,4,0,4,1,null,null,3,null,null,1]
[2,null,"JUAN NICOLAS ALVIAR",null,"CC",2,4,0,4,null,null,null,null,null,null,null,null,2,4,4,0,4,5,4,0,4,1,null,null,1,null,null,3]
[3,null,"JUAN ESTEBAN PINZON ALVAREZ",null,"FULL",1,4,0,4,null,null,4,2,0,4,5,4,null,null,null,null,null,null,4,0,4,0,null,null,2,null,null,2]
[4,null,"DAVID MORENO ARANGO",null,"IND",0,4,1,4,null,null,0,4,1,4,null,null,0,4,0,4,null,null,null,null,null,null,null,null,0,null,null,4]
[]
[null,null,"CUADRO NO. 2"]
["N°","Rank","NOMBRE",null,"Liga",null,null,null,1,null,null,null,null,null,2,null,null,null,null,null,3,null,null,null,null,null,4,null,null,"PUNTOS","% SETS","% GAMES","PUESTO"]
[5,null,"MATIAS CORNEJO PRIETO",null,"VERS",null,null,null,null,null,null,4,2,4,0,null,null,4,2,4,0,null,null,null,null,null,null,null,null,2,null,null,1]
[6,null,"NICOLAS DAVILA PLATA",null,"CC",2,4,0,4,null,null,null,null,null,null,null,null,0,4,5,3,5,4,null,null,null,null,null,null,1,null,null,2]
[7,null,"LUIS FELIPE MONSALVE",null,"FULL",2,4,0,4,null,null,4,0,3,5,4,5,null,null,null,null,null,null,null,null,null,null,null,null,0,null,null,3]
[8]
[]
[null,null,"CUADRO NO. 3"]
["N°","Rank","NOMBRE",null,"Liga",null,null,null,1,null,null,null,null,null,2,null,null,null,null,null,3,null,null,null,null,null,4,null,null,"PUNTOS","% SETS","% GAMES","PUESTO"]
[9,null,"TEDDY FOSTER  CAMARGO",null,"CC",null,null,null,null,null,null,4,0,4,1,null,null,4,1,4,2,null,null,4,1,2,4,4,5,2,null,null,2]
[10,null,"ANDRES FELIPE MORENO M.",null,"PONAL",0,4,1,4,null,null,null,null,null,null,null,null,1,4,4,5,null,null,0,4,1,4,null,null,0,null,null,4]
[11,null,"SANTIAGO CAÑAS ORTIZ",null,"LT",1,4,2,4,null,null,4,1,5,4,null,null,null,null,null,null,null,null,0,null,4,1,4,null,1,null,null,3]
[12,null,"TOMAS ARANA BRAVO",null,"MIR",1,4,4,2,5,4,4,0,4,1,null,null,4,0,4,1,null,null,null,null,null,null,null,null,3,null,null,1]
[]
[null,null,"CUADRO NO. 4"]
["N°","Rank","NOMBRE",null,"Liga",null,null,null,1,null,null,null,null,null,2,null,null,null,null,null,3,null,null,null,null,null,4,null,null,"PUNTOS","% SETS","% GAMES","PUESTO"]
[13,{"$f":"UPPER(IF($D31=\"\",\"\",VLOOKUP($D31,#REF!,7)))","v":""},"MARIANA PARRA HERRERA",null,"MED",null,null,null,null,null,null,4,0,4,0,null,null,4,2,4,2,null,null,4,0,4,0,null,null,3,null,null,1]
[14,{"$f":"UPPER(IF($D32=\"\",\"\",VLOOKUP($D32,#REF!,7)))","v":""},"GABRIELA MENDOZA ARIAS",null,"CC",0,4,0,4,null,null,null,null,null,null,null,null,4,0,4,0,null,null,2,4,4,2,5,4,2,null,null,2]
[15,{"$f":"UPPER(IF($D33=\"\",\"\",VLOOKUP($D33,#REF!,7)))","v":""},"ISABELLA TURBAY VARGAS",null,"ST",2,4,2,4,null,null,0,4,0,4,null,null,null,null,null,null,null,null,1,4,3,5,null,null,0,null,null,4]
[16,{"$f":"UPPER(IF($D34=\"\",\"\",VLOOKUP($D34,#REF!,7)))","v":""},"JUAN JOSE LUNA SAAVEDRA",null,"LT",0,4,0,4,null,null,4,2,2,4,4,5,4,1,5,3,null,null,null,null,null,null,null,null,1,null,null,3]

{"sheet":"Round Robin (2)","index":2,"n_rows":34,"n_cols":33,"rows_kept":34,"cut":false,"hidden":false,"merged":[[6,7,6,16]]}
[null,null,null,null,"SENCILLOS CUADRO DE ROUND ROBIN"]
["Torneo",null,null,null,{"$f":"Maestra!A10","v":"4TA PARADA DEPARTAMENTAL INFANTIL 2019"}]
["Sede",null,null,null,{"$f":"Maestra!A14","v":"LIGA SANTANDEREANA DE TENIS"}]
["Clase",null,null,null,{"$f":"Maestra!E10","v":"SENCILLOS "}]
["Ciudad",null,null,null,{"$f":"Maestra!E14","v":"BUCARAMANGA"}]
["Categoría",null,null,null,{"$f":"Maestra!H10","v":"HASTA 10 AÑOS"}]
["Fecha",null,{"$f":"Maestra!H14","v":"2019-10-26"},null,null,null,null,"COORDINADORA",null,null,null,null,null,null,null,null,null,null,null,null,null,null,null,null,null,null,null,null,null,{"$f":"Maestra!A18","v":"PAOLA A CHINCHILLA "}]
[null,null,"CUADRO NO. 5"]
["N°","Rank","NOMBRE",null,"Liga",null,null,null,1,null,null,null,null,null,2,null,null,null,null,null,3,null,null,null,null,null,4,null,null,"PUNTOS","% SETS","% GAMES","PUESTO"]
[17,{"$f":"UPPER(IF($D10=\"\",\"\",VLOOKUP($D10,#REF!,7)))","v":""},"SANTIAGO CORTES QUINTERO",null,"FULL",null,null,null,null,null,null,4,2,4,1,null,null,5,3,4,2,null,null,4,2,3,5,5,4,3,null,null,1]
[18,{"$f":"UPPER(IF($D11=\"\",\"\",VLOOKUP($D11,#REF!,7)))","v":""},"JULIAN ANDRES CONTRERAS N.",null,"CC",2,4,1,4,null,null,null,null,null,null,null,null,0,4,3,5,null,null,3,5,0,4,null,null,0,null,null,4]
[19,{"$f":"UPPER(IF($D12=\"\",\"\",VLOOKUP($D12,#REF!,7)))","v":""},"SAMUEL ANGULO GIRALDO",null,"CC",3,5,2,4,null,null,4,0,5,3,null,null,null,null,null,null,null,null,0,4,1,4,null,null,1,null,null,3]
[20,{"$f":"UPPER(IF($D13=\"\",\"\",VLOOKUP($D13,#REF!,7)))","v":""},"MATEO TURBAY VARGAS",null,"ST",2,4,5,3,4,5,5,3,4,0,null,null,4,0,4,1,null,null,null,null,null,null,null,null,2,null,null,2]
[]
[null,null,"CUADRO NO. 6"]
["N°","Rank","NOMBRE",null,"Liga",null,null,null,1,null,null,null,null,null,2,null,null,null,null,null,3,null,null,null,null,null,4,null,null,"PUNTOS","% SETS","% GAMES","PUESTO"]
[21,{"$f":"UPPER(IF($D17=\"\",\"\",VLOOKUP($D17,#REF!,7)))","v":""}]
[22,{"$f":"UPPER(IF($D18=\"\",\"\",VLOOKUP($D18,#REF!,7)))","v":""}]
[23,{"$f":"UPPER(IF($D19=\"\",\"\",VLOOKUP($D19,#REF!,7)))","v":""}]
[24,{"$f":"UPPER(IF($D20=\"\",\"\",VLOOKUP($D20,#REF!,7)))","v":""}]
[]
[null,null,"CUADRO NO. 7"]
["N°","Rank","NOMBRE",null,"Liga",null,null,null,1,null,null,null,null,null,2,null,null,null,null,null,3,null,null,null,null,null,4,null,null,"PUNTOS","% SETS","% GAMES","PUESTO"]
[25,{"$f":"UPPER(IF($D24=\"\",\"\",VLOOKUP($D24,#REF!,7)))","v":""}]
[26,{"$f":"UPPER(IF($D25=\"\",\"\",VLOOKUP($D25,#REF!,7)))","v":""}]
[27,{"$f":"UPPER(IF($D26=\"\",\"\",VLOOKUP($D26,#REF!,7)))","v":""}]
[28,{"$f":"UPPER(IF($D27=\"\",\"\",VLOOKUP($D27,#REF!,7)))","v":""}]
[]
[null,null,"CUADRO NO. 8"]
["N°","Rank","NOMBRE",null,"Liga",null,null,null,1,null,null,null,null,null,2,null,null,null,null,null,3,null,null,null,null,null,4,null,null,"PUNTOS","% SETS","% GAMES","PUESTO"]
[29,{"$f":"UPPER(IF($D31=\"\",\"\",VLOOKUP($D31,#REF!,7)))","v":""}]
[30,{"$f":"UPPER(IF($D32=\"\",\"\",VLOOKUP($D32,#REF!,7)))","v":""}]
[31,{"$f":"UPPER(IF($D33=\"\",\"\",VLOOKUP($D33,#REF!,7)))","v":""}]
[32,{"$f":"UPPER(IF($D34=\"\",\"\",VLOOKUP($D34,#REF!,7)))","v":""}]

{"sheet":"Eliminación Sencilla","index":3,"n_rows":68,"n_cols":19,"rows_kept":68,"cut":false,"hidden":false,"merged":[[49,20,51,20],[50,11,50,12],[58,11,58,12],[62,11,62,12],[65,9,65,10],[25,20,28,20],[26,11,26,12],[32,13,32,14],[34,11,34,12],[38,11,38,12],[46,11,46,12],[1,1,1,4],[10,11,10,12],[12,15,12,16],[14,11,14,12],[18,11,18,12],[22,11,22,12]]}
[null,null,null,null,null,null,null,"SENCILLOS CUADRO PRINCIPAL"]
["Torneo","4TA PARADA DEPARTAMENTAL INFANTIL 2019",null,null,null,"Clase",null,"Sencillos",null,null,null,"Categoría",null,"HASTA 10 "]
["Sede","Liga Santandereana de Tenis ",null,null,null,"Ciudad",null,"Bucaramanga",null,null,null,"Fecha",null,"2019-10-27"]
[]
[1,{"$f":"UPPER(IF($D5=\"\",\"\",VLOOKUP($D5,#REF!,6)))","v":""},{"$f":"UPPER(IF($D5=\"\",\"\",VLOOKUP($D5,#REF!,7)))","v":""}]
[2,{"$f":"UPPER(IF($D6=\"\",\"\",VLOOKUP($D6,#REF!,6)))","v":""},{"$f":"UPPER(IF($D6=\"\",\"\",VLOOKUP($D6,#REF!,7)))","v":""}]
[3,{"$f":"UPPER(IF($D7=\"\",\"\",VLOOKUP($D7,#REF!,6)))","v":""},{"$f":"UPPER(IF($D7=\"\",\"\",VLOOKUP($D7,#REF!,7)))","v":""},null,null,null,null,null,null,null,null,null,null,"EMMANUEL JOSEPH"]
[4,{"$f":"UPPER(IF($D8=\"\",\"\",VLOOKUP($D8,#REF!,6)))","v":""},{"$f":"UPPER(IF($D8=\"\",\"\",VLOOKUP($D8,#REF!,7)))","v":""},null,null,null,null,null,null,null,null,null,null,"CARRILLO VILLABA (LT)"]
[5,{"$f":"UPPER(IF($D9=\"\",\"\",VLOOKUP($D9,#REF!,6)))","v":""},{"$f":"UPPER(IF($D9=\"\",\"\",VLOOKUP($D9,#REF!,7)))","v":""}]
[6,{"$f":"UPPER(IF($D10=\"\",\"\",VLOOKUP($D10,#REF!,6)))","v":""},{"$f":"UPPER(IF($D10=\"\",\"\",VLOOKUP($D10,#REF!,7)))","v":""}]
[7,{"$f":"UPPER(IF($D11=\"\",\"\",VLOOKUP($D11,#REF!,6)))","v":""},{"$f":"UPPER(IF($D11=\"\",\"\",VLOOKUP($D11,#REF!,7)))","v":""},null,null,null,null,null,null,null,null,null,null,null,null,"EMMANUEL JOSEPH"]
[8,{"$f":"UPPER(IF($D12=\"\",\"\",VLOOKUP($D12,#REF!,6)))","v":""},{"$f":"UPPER(IF($D12=\"\",\"\",VLOOKUP($D12,#REF!,7)))","v":""},null,null,null,null,null,null,null,null,null,null,null,null,"CARRILLO VILLABA (LT)"]
[9,{"$f":"UPPER(IF($D13=\"\",\"\",VLOOKUP($D13,#REF!,6)))","v":""},{"$f":"UPPER(IF($D13=\"\",\"\",VLOOKUP($D13,#REF!,7)))","v":""},null,null,null,null,null,null,null,null,"NICOLAS ",null,null,null,"4/0 4/1"]
[10,{"$f":"UPPER(IF($D14=\"\",\"\",VLOOKUP($D14,#REF!,6)))","v":""},{"$f":"UPPER(IF($D14=\"\",\"\",VLOOKUP($D14,#REF!,7)))","v":""},null,null,null,null,null,null,null,null,"DAVILA PLATA (CC)"]
[11,{"$f":"UPPER(IF($D15=\"\",\"\",VLOOKUP($D15,#REF!,6)))","v":""},{"$f":"UPPER(IF($D15=\"\",\"\",VLOOKUP($D15,#REF!,7)))","v":""},null,null,null,null,null,null,null,null,null,null,"NICOLAS "]
[12,{"$f":"UPPER(IF($D16=\"\",\"\",VLOOKUP($D16,#REF!,6)))","v":""},{"$f":"UPPER(IF($D16=\"\",\"\",VLOOKUP($D16,#REF!,7)))","v":""},null,null,null,null,null,null,null,null,null,null,"DAVILA PLATA (CC)"]
[13,{"$f":"UPPER(IF($D17=\"\",\"\",VLOOKUP($D17,#REF!,6)))","v":""},{"$f":"UPPER(IF($D17=\"\",\"\",VLOOKUP($D17,#REF!,7)))","v":""},null,null,null,null,null,null,null,null,"GABRIELA ",null,"4/0 4/0"]
[14,{"$f":"UPPER(IF($D18=\"\",\"\",VLOOKUP($D18,#REF!,6)))","v":""},{"$f":"UPPER(IF($D18=\"\",\"\",VLOOKUP($D18,#REF!,7)))","v":""},null,null,null,null,null,null,null,null,"MENDOZA ARIAS (CC)"]
[15,{"$f":"UPPER(IF($D19=\"\",\"\",VLOOKUP($D19,#REF!,6)))","v":""},{"$f":"UPPER(IF($D19=\"\",\"\",VLOOKUP($D19,#REF!,7)))","v":""},null,null,null,null,null,null,null,null,null,null,null,null,null,null,null,"EMMANUEL JOSEPH"]
[16,{"$f":"UPPER(IF($D20=\"\",\"\",VLOOKUP($D20,#REF!,6)))","v":""},{"$f":"UPPER(IF($D20=\"\",\"\",VLOOKUP($D20,#REF!,7)))","v":""},null,null,null,null,null,null,null,null,null,null,null,null,null,null,null,"CARRILLO VILLABA (LT)"]
[17,{"$f":"UPPER(IF($D21=\"\",\"\",VLOOKUP($D21,#REF!,6)))","v":""},{"$f":"UPPER(IF($D21=\"\",\"\",VLOOKUP($D21,#REF!,7)))","v":""},null,null,null,null,null,null,null,null,null,null,null,null,null,null,null,"4/1 4/1"]
[18,{"$f":"UPPER(IF($D22=\"\",\"\",VLOOKUP($D22,#REF!,6)))","v":""},{"$f":"UPPER(IF($D22=\"\",\"\",VLOOKUP($D22,#REF!,7)))","v":""}]
[19,{"$f":"UPPER(IF($D23=\"\",\"\",VLOOKUP($D23,#REF!,6)))","v":""},{"$f":"UPPER(IF($D23=\"\",\"\",VLOOKUP($D23,#REF!,7)))","v":""},null,null,null,null,null,null,null,null,null,null,"SANTIAGO "]
[20,{"$f":"UPPER(IF($D24=\"\",\"\",VLOOKUP($D24,#REF!,6)))","v":""},{"$f":"UPPER(IF($D24=\"\",\"\",VLOOKUP($D24,#REF!,7)))","v":""},null,null,null,null,null,null,null,null,null,null,"CORTES QUINTERO (FULL)"]
[21,{"$f":"UPPER(IF($D25=\"\",\"\",VLOOKUP($D25,#REF!,6)))","v":""},{"$f":"UPPER(IF($D25=\"\",\"\",VLOOKUP($D25,#REF!,7)))","v":""}]
[22,{"$f":"UPPER(IF($D26=\"\",\"\",VLOOKUP($D26,#REF!,6)))","v":""},{"$f":"UPPER(IF($D26=\"\",\"\",VLOOKUP($D26,#REF!,7)))","v":""}]
[23,{"$f":"UPPER(IF($D27=\"\",\"\",VLOOKUP($D27,#REF!,6)))","v":""},{"$f":"UPPER(IF($D27=\"\",\"\",VLOOKUP($D27,#REF!,7)))","v":""},null,null,null,null,null,null,null,null,null,null,null,null,"TEDDY "]
[24,{"$f":"UPPER(IF($D28=\"\",\"\",VLOOKUP($D28,#REF!,6)))","v":""},{"$f":"UPPER(IF($D28=\"\",\"\",VLOOKUP($D28,#REF!,7)))","v":""},null,null,null,null,null,null,null,null,null,null,null,null,"FOSTER CAMARGO (CC)"]
[25,{"$f":"UPPER(IF($D29=\"\",\"\",VLOOKUP($D29,#REF!,6)))","v":""},{"$f":"UPPER(IF($D29=\"\",\"\",VLOOKUP($D29,#REF!,7)))","v":""},null,null,null,null,null,null,null,null,null,null,null,null,"4/1 4/1"]
[26,{"$f":"UPPER(IF($D30=\"\",\"\",VLOOKUP($D30,#REF!,6)))","v":""},{"$f":"UPPER(IF($D30=\"\",\"\",VLOOKUP($D30,#REF!,7)))","v":""}]
[27,{"$f":"UPPER(IF($D31=\"\",\"\",VLOOKUP($D31,#REF!,6)))","v":""},{"$f":"UPPER(IF($D31=\"\",\"\",VLOOKUP($D31,#REF!,7)))","v":""},null,null,null,null,null,null,null,null,null,null,"TEDDY "]
[28,{"$f":"UPPER(IF($D32=\"\",\"\",VLOOKUP($D32,#REF!,6)))","v":""},{"$f":"UPPER(IF($D32=\"\",\"\",VLOOKUP($D32,#REF!,7)))","v":""},null,null,null,null,null,null,null,null,null,null,"FOSTER CAMARGO (CC)"]
[29,{"$f":"UPPER(IF($D33=\"\",\"\",VLOOKUP($D33,#REF!,6)))","v":""},{"$f":"UPPER(IF($D33=\"\",\"\",VLOOKUP($D33,#REF!,7)))","v":""}]
[30,{"$f":"UPPER(IF($D34=\"\",\"\",VLOOKUP($D34,#REF!,6)))","v":""},{"$f":"UPPER(IF($D34=\"\",\"\",VLOOKUP($D34,#REF!,7)))","v":""},null,null,null,null,null,null,null,null,null,null,null,null,null,null,null,"EMMANUEL JOSEPH"]
[31,{"$f":"UPPER(IF($D35=\"\",\"\",VLOOKUP($D35,#REF!,6)))","v":""},{"$f":"UPPER(IF($D35=\"\",\"\",VLOOKUP($D35,#REF!,7)))","v":""},null,null,null,null,null,null,null,null,null,null,null,null,null,null,null,"CARRILLO VILLABA (LT)"]
[32,{"$f":"UPPER(IF($D36=\"\",\"\",VLOOKUP($D36,#REF!,6)))","v":""},{"$f":"UPPER(IF($D36=\"\",\"\",VLOOKUP($D36,#REF!,7)))","v":""},null,null,null,null,null,null,null,null,null,null,null,null,null,null,null,"4/1 4/1"]
[33,{"$f":"UPPER(IF($D37=\"\",\"\",VLOOKUP($D37,#REF!,6)))","v":""},{"$f":"UPPER(IF($D37=\"\",\"\",VLOOKUP($D37,#REF!,7)))","v":""}]
[34,{"$f":"UPPER(IF($D38=\"\",\"\",VLOOKUP($D38,#REF!,6)))","v":""},{"$f":"UPPER(IF($D38=\"\",\"\",VLOOKUP($D38,#REF!,7)))","v":""}]
[35,{"$f":"UPPER(IF($D39=\"\",\"\",VLOOKUP($D39,#REF!,6)))","v":""},{"$f":"UPPER(IF($D39=\"\",\"\",VLOOKUP($D39,#REF!,7)))","v":""},null,null,null,null,null,null,null,null,null,null,"MARIANA"]
[36,{"$f":"UPPER(IF($D40=\"\",\"\",VLOOKUP($D40,#REF!,6)))","v":""},{"$f":"UPPER(IF($D40=\"\",\"\",VLOOKUP($D40,#REF!,7)))","v":""},null,null,null,null,null,null,null,null,null,null,"PARRA HERRERA (MED)"]
{"$rows_left_out":29}
{"sheet":"Eliminación Sencilla B","index":4,"n_rows":68,"n_cols":19,"rows_kept":68,"cut":false,"hidden":false,"merged":[[46,11,46,12],[1,1,1,4],[10,11,10,12],[12,15,12,16],[14,11,14,12],[18,11,18,12],[22,11,22,12],[49,20,51,20],[50,11,50,12],[58,11,58,12],[62,11,62,12],[65,9,65,10],[25,20,28,20],[26,11,26,12],[32,13,32,14],[34,11,34,12],[38,11,38,12]]}
[null,null,null,null,null,null,null,"SENCILLOS CUADRO PRINCIPAL"]
["Torneo","4TA PARADA DEPARTAMENTAL INFANTIL 2019",null,null,null,"Clase",null,"Sencillos",null,null,null,"Categoría",null,"HASTA 10  B"]
["Sede","Liga Santandereana de Tenis ",null,null,null,"Ciudad",null,"Bucaramanga",null,null,null,"Fecha",null,"2019-10-27"]
[]
[1,{"$f":"UPPER(IF($D5=\"\",\"\",VLOOKUP($D5,#REF!,6)))","v":""},{"$f":"UPPER(IF($D5=\"\",\"\",VLOOKUP($D5,#REF!,7)))","v":""}]
[2,{"$f":"UPPER(IF($D6=\"\",\"\",VLOOKUP($D6,#REF!,6)))","v":""},{"$f":"UPPER(IF($D6=\"\",\"\",VLOOKUP($D6,#REF!,7)))","v":""}]
[3,{"$f":"UPPER(IF($D7=\"\",\"\",VLOOKUP($D7,#REF!,6)))","v":""},{"$f":"UPPER(IF($D7=\"\",\"\",VLOOKUP($D7,#REF!,7)))","v":""},null,null,null,null,null,null,null,null,null,null,"JUAN NICOLAS "]
[4,{"$f":"UPPER(IF($D8=\"\",\"\",VLOOKUP($D8,#REF!,6)))","v":""},{"$f":"UPPER(IF($D8=\"\",\"\",VLOOKUP($D8,#REF!,7)))","v":""},null,null,null,null,null,null,null,null,null,null,"ALVIAR (CC)"]
[5,{"$f":"UPPER(IF($D9=\"\",\"\",VLOOKUP($D9,#REF!,6)))","v":""},{"$f":"UPPER(IF($D9=\"\",\"\",VLOOKUP($D9,#REF!,7)))","v":""}]
[6,{"$f":"UPPER(IF($D10=\"\",\"\",VLOOKUP($D10,#REF!,6)))","v":""},{"$f":"UPPER(IF($D10=\"\",\"\",VLOOKUP($D10,#REF!,7)))","v":""}]
[7,{"$f":"UPPER(IF($D11=\"\",\"\",VLOOKUP($D11,#REF!,6)))","v":""},{"$f":"UPPER(IF($D11=\"\",\"\",VLOOKUP($D11,#REF!,7)))","v":""},null,null,null,null,null,null,null,null,null,null,null,null,"JUAN NICOLAS "]
[8,{"$f":"UPPER(IF($D12=\"\",\"\",VLOOKUP($D12,#REF!,6)))","v":""},{"$f":"UPPER(IF($D12=\"\",\"\",VLOOKUP($D12,#REF!,7)))","v":""},null,null,null,null,null,null,null,null,null,null,null,null,"ALVIAR (CC)"]
[9,{"$f":"UPPER(IF($D13=\"\",\"\",VLOOKUP($D13,#REF!,6)))","v":""},{"$f":"UPPER(IF($D13=\"\",\"\",VLOOKUP($D13,#REF!,7)))","v":""},null,null,null,null,null,null,null,null,"JULIAN ANDRES ",null,null,null,"4/0 4/0"]
[10,{"$f":"UPPER(IF($D14=\"\",\"\",VLOOKUP($D14,#REF!,6)))","v":""},{"$f":"UPPER(IF($D14=\"\",\"\",VLOOKUP($D14,#REF!,7)))","v":""},null,null,null,null,null,null,null,null,"CONTRERAS (CC)"]
[11,{"$f":"UPPER(IF($D15=\"\",\"\",VLOOKUP($D15,#REF!,6)))","v":""},{"$f":"UPPER(IF($D15=\"\",\"\",VLOOKUP($D15,#REF!,7)))","v":""},null,null,null,null,null,null,null,null,null,null,"JULIAN ANDRES "]
[12,{"$f":"UPPER(IF($D16=\"\",\"\",VLOOKUP($D16,#REF!,6)))","v":""},{"$f":"UPPER(IF($D16=\"\",\"\",VLOOKUP($D16,#REF!,7)))","v":""},null,null,null,null,null,null,null,null,null,null,"CONTRERAS (CC)"]
[13,{"$f":"UPPER(IF($D17=\"\",\"\",VLOOKUP($D17,#REF!,6)))","v":""},{"$f":"UPPER(IF($D17=\"\",\"\",VLOOKUP($D17,#REF!,7)))","v":""},null,null,null,null,null,null,null,null,"ISABELLA ",null,"4/1 4/0"]
[14,{"$f":"UPPER(IF($D18=\"\",\"\",VLOOKUP($D18,#REF!,6)))","v":""},{"$f":"UPPER(IF($D18=\"\",\"\",VLOOKUP($D18,#REF!,7)))","v":""},null,null,null,null,null,null,null,null,"TURBAY VARGAS (ST)"]
[15,{"$f":"UPPER(IF($D19=\"\",\"\",VLOOKUP($D19,#REF!,6)))","v":""},{"$f":"UPPER(IF($D19=\"\",\"\",VLOOKUP($D19,#REF!,7)))","v":""},null,null,null,null,null,null,null,null,null,null,null,null,null,null,null,"JUAN NICOLAS "]
[16,{"$f":"UPPER(IF($D20=\"\",\"\",VLOOKUP($D20,#REF!,6)))","v":""},{"$f":"UPPER(IF($D20=\"\",\"\",VLOOKUP($D20,#REF!,7)))","v":""},null,null,null,null,null,null,null,null,null,null,null,null,null,null,null,"ALVIAR (CC)"]
[17,{"$f":"UPPER(IF($D21=\"\",\"\",VLOOKUP($D21,#REF!,6)))","v":""},{"$f":"UPPER(IF($D21=\"\",\"\",VLOOKUP($D21,#REF!,7)))","v":""},null,null,null,null,null,null,null,null,null,null,null,null,null,null,null,"4/2 4/0"]
[18,{"$f":"UPPER(IF($D22=\"\",\"\",VLOOKUP($D22,#REF!,6)))","v":""},{"$f":"UPPER(IF($D22=\"\",\"\",VLOOKUP($D22,#REF!,7)))","v":""}]
[19,{"$f":"UPPER(IF($D23=\"\",\"\",VLOOKUP($D23,#REF!,6)))","v":""},{"$f":"UPPER(IF($D23=\"\",\"\",VLOOKUP($D23,#REF!,7)))","v":""},null,null,null,null,null,null,null,null,null,null,"SAMUEL "]
[20,{"$f":"UPPER(IF($D24=\"\",\"\",VLOOKUP($D24,#REF!,6)))","v":""},{"$f":"UPPER(IF($D24=\"\",\"\",VLOOKUP($D24,#REF!,7)))","v":""},null,null,null,null,null,null,null,null,null,null,"ANGULO GIRALDO (CC)"]
[21,{"$f":"UPPER(IF($D25=\"\",\"\",VLOOKUP($D25,#REF!,6)))","v":""},{"$f":"UPPER(IF($D25=\"\",\"\",VLOOKUP($D25,#REF!,7)))","v":""}]
[22,{"$f":"UPPER(IF($D26=\"\",\"\",VLOOKUP($D26,#REF!,6)))","v":""},{"$f":"UPPER(IF($D26=\"\",\"\",VLOOKUP($D26,#REF!,7)))","v":""}]
[23,{"$f":"UPPER(IF($D27=\"\",\"\",VLOOKUP($D27,#REF!,6)))","v":""},{"$f":"UPPER(IF($D27=\"\",\"\",VLOOKUP($D27,#REF!,7)))","v":""},null,null,null,null,null,null,null,null,null,null,null,null,"SANTIAGO"]
[24,{"$f":"UPPER(IF($D28=\"\",\"\",VLOOKUP($D28,#REF!,6)))","v":""},{"$f":"UPPER(IF($D28=\"\",\"\",VLOOKUP($D28,#REF!,7)))","v":""},null,null,null,null,null,null,null,null,null,null,null,null,"CAÑAS (LT)"]
[25,{"$f":"UPPER(IF($D29=\"\",\"\",VLOOKUP($D29,#REF!,6)))","v":""},{"$f":"UPPER(IF($D29=\"\",\"\",VLOOKUP($D29,#REF!,7)))","v":""},null,null,null,null,null,null,null,null,null,null,null,null,"4/0 4/0"]
[26,{"$f":"UPPER(IF($D30=\"\",\"\",VLOOKUP($D30,#REF!,6)))","v":""},{"$f":"UPPER(IF($D30=\"\",\"\",VLOOKUP($D30,#REF!,7)))","v":""}]
[27,{"$f":"UPPER(IF($D31=\"\",\"\",VLOOKUP($D31,#REF!,6)))","v":""},{"$f":"UPPER(IF($D31=\"\",\"\",VLOOKUP($D31,#REF!,7)))","v":""},null,null,null,null,null,null,null,null,null,null,"SANTIAGO"]
[28,{"$f":"UPPER(IF($D32=\"\",\"\",VLOOKUP($D32,#REF!,6)))","v":""},{"$f":"UPPER(IF($D32=\"\",\"\",VLOOKUP($D32,#REF!,7)))","v":""},null,null,null,null,null,null,null,null,null,null,"CAÑAS (LT)"]
[29,{"$f":"UPPER(IF($D33=\"\",\"\",VLOOKUP($D33,#REF!,6)))","v":""},{"$f":"UPPER(IF($D33=\"\",\"\",VLOOKUP($D33,#REF!,7)))","v":""}]
[30,{"$f":"UPPER(IF($D34=\"\",\"\",VLOOKUP($D34,#REF!,6)))","v":""},{"$f":"UPPER(IF($D34=\"\",\"\",VLOOKUP($D34,#REF!,7)))","v":""},null,null,null,null,null,null,null,null,null,null,null,null,null,null,null,"JUAN NICOLAS "]
[31,{"$f":"UPPER(IF($D35=\"\",\"\",VLOOKUP($D35,#REF!,6)))","v":""},{"$f":"UPPER(IF($D35=\"\",\"\",VLOOKUP($D35,#REF!,7)))","v":""},null,null,null,null,null,null,null,null,null,null,null,null,null,null,null,"ALVIAR (CC)"]
[32,{"$f":"UPPER(IF($D36=\"\",\"\",VLOOKUP($D36,#REF!,6)))","v":""},{"$f":"UPPER(IF($D36=\"\",\"\",VLOOKUP($D36,#REF!,7)))","v":""},null,null,null,null,null,null,null,null,null,null,null,null,null,null,null,"4/1 1/4 4/2"]
[33,{"$f":"UPPER(IF($D37=\"\",\"\",VLOOKUP($D37,#REF!,6)))","v":""},{"$f":"UPPER(IF($D37=\"\",\"\",VLOOKUP($D37,#REF!,7)))","v":""}]
[34,{"$f":"UPPER(IF($D38=\"\",\"\",VLOOKUP($D38,#REF!,6)))","v":""},{"$f":"UPPER(IF($D38=\"\",\"\",VLOOKUP($D38,#REF!,7)))","v":""}]
[35,{"$f":"UPPER(IF($D39=\"\",\"\",VLOOKUP($D39,#REF!,6)))","v":""},{"$f":"UPPER(IF($D39=\"\",\"\",VLOOKUP($D39,#REF!,7)))","v":""},null,null,null,null,null,null,null,null,null,null,"JUAN JOSE "]
[36,{"$f":"UPPER(IF($D40=\"\",\"\",VLOOKUP($D40,#REF!,6)))","v":""},{"$f":"UPPER(IF($D40=\"\",\"\",VLOOKUP($D40,#REF!,7)))","v":""},null,null,null,null,null,null,null,null,null,null,"LUNA SAAVEDRA (LT)"]
{"$rows_left_out":29}
{"sheet":"Hoja1","index":5,"n_rows":0,"n_cols":0,"rows_kept":0,"cut":false,"hidden":false,"merged":[]}